{"text_format":"1","workbook":"xlsx","n_sheets":4,"sheets":["Rekenblad","Gemeenten met categorie","INFO","Tabel Tarieven"],"not_rendered":{"charts":0,"images":1,"macros":1,"external_links":1,"defined_names":10,"comments":0,"pivot_tables":0},"unopened":[],"bounds":{"document_bytes":16777216,"sheet_cells":100000,"rows_first":2000,"rows_last":500,"rows_between":2000,"halvings":0,"cell_chars":16384,"cell_head_chars":4096},"cells_cut":0,"cells_raw":0,"read":"whole","date_system":"1900"}

{"sheet":"Rekenblad","index":0,"n_rows":88,"n_cols":14,"rows_kept":88,"cut":false,"hidden":false,"merged":[[0,12,0,13],[9,3,9,6],[13,3,13,4],[10,3,10,4],[10,5,10,6],[4,10,4,11],[10,7,13,11],[12,3,12,4],[4,1,4,9],[3,11,3,13],[2,10,2,11],[3,8,3,9],[3,1,3,6],[2,12,2,13],[4,12,4,13],[9,12,9,13],[5,12,5,13],[20,11,20,13],[14,7,17,11],[18,12,18,13],[16,12,17,13],[20,8,20,10],[18,7,18,11],[26,0,26,1],[21,2,22,4],[25,0,25,1],[28,2,28,4],[23,9,23,10],[25,9,25,10],[26,9,26,10],[24,9,24,10],[27,9,27,10],[21,8,22,8],[21,9,22,10],[27,0,27,1],[21,5,22,7],[14,1,14,2],[17,0,17,1],[15,0,15,1],[15,5,15,6],[16,5,16,6],[17,5,17,6],[15,3,15,4],[16,3,17,4],[16,0,16,1],[18,5,18,6],[20,2,20,7],[18,3,18,4],[24,0,24,1],[19,0,19,4],[20,0,20,1],[22,0,22,1],[21,0,21,1],[23,0,23,1],[0,0,0,8],[13,1,13,2],[13,5,13,6],[14,5,14,6],[12,5,12,6],[9,0,9,2],[1,0,1,8],[10,1,10,2],[11,1,11,2],[12,1,12,2],[11,3,11,4],[14,3,14,4],[5,5,5,9],[11,5,11,6],[2,1,2,3],[2,5,2,9],[35,13,36,13],[32,0,32,1],[32,9,32,10],[28,5,28,7],[28,8,28,10],[29,9,29,10],[30,9,30,10],[31,9,31,10],[31,0,31,1],[33,2,34,13],[30,0,30,1],[29,0,29,1],[35,6,35,7],[35,4,35,5],[35,9,35,12]]}
[{"$f":"\"Melding en berekening straatwerk\" & MID('Tabel Tarieven'!K1,10,5)","v":"Melding en berekening straatwerk 2021"},null,null,null,null,null,null,null,null,null,null,null,{"$f":"\"Versie \"&MID('Tabel Tarieven'!K1,11,8)","v":"Versie 2021 v1 "}]
["volgens de Richtlijn Tarieven (graaf) werkzaamheden Telecom dd 12-03-2004.",null,null,null,null,null,null,null,null,null,null,"Datum:",{"$f":"NOW()","v":"2020-12-04T08:45:50.230"}]
["AANVRAGER:","……………………………….",null,null,"Adres:","……………………………………………………………………",null,null,null,null,"Contactpersoon:",null,"………………………………………"]
["NAAM PROJECT:","…………………………………………………………………………………………………..",null,null,null,null,null,"Ref.nr:","…………………………………………………………………………………………………..",null,"E-mail:","…………..……………………………………….."]
["PLAATS:","…………………………………………………………………………………………………..",null,null,null,null,null,null,null,null,null,null,"………………………………………"]
["GEMEENTE:",null,null,null,"adres:",{"$f":"IF($B$7>0.1,VLOOKUP(B7,'Gemeenten met categorie'!A3:D484,4),\"\")","v":"  Postbus 93,  9460 AB  GIETEN"},null,null,null,null,null,"Telefoon:","………………………………………"]
[null,1,null,{"$f":"IF($B$7>0.1,VLOOKUP($B$7,'Gemeenten met categorie'!A2:D493,3),\"\")","v":1}]
["Uitvoering:"]
[1,null,null,null,null,null,null,null,null,null,null,null,"  "]
["Gemeentelijke gegevens:",null,null,"Verzamelde informatie:",null,null,null,"Toegepast tarief",null,null,null,null,"Bedrag:"]
["Contactpersoon gem.:","………………………",null,"Inkoopordernr.:",null,"Projectnr:",null,{"$f":"INDEX('Gemeenten met categorie'!D499:D504,A9,1)","v":"Tarief A:  Herstel en onderhoud uitgevoerd door de gemeente"},null,null,null,null,"Uitv.k",{"$f":"SUM(J38:J51)","v":0}]
["E-mail:","………………………",null,"………………",null,"…………….",null,null,null,null,null,null,"Onderh.k",{"$f":"SUM(K38:K51)","v":0}]
["telefoon:","………………………",null,"Datum opbreking:",null,"………………..",null,null,null,null,null,null,"Deg.kst.",{"$f":"SUM(L38:L51)","v":0}]
["mobiel:","………………………",null,"Datum herstel:",null,"………………..",null,null,null,null,null,null,"Beheer.k",{"$f":"SUM(M38:M51)","v":0}]
["Opdrachtnummer :","………………………",null,"Deellevering:",null,"………………..",null,{"$f":"INDEX('Gemeenten met categorie'!D499:F504,A9,2)","v":0},null,null,null,null,"Bomen/str",{"$f":"N28","v":0}]
["In te vullen gegevens:",null,null,"Laatste levering:",null,"………………..",null,null,null,null,null,null,"Asfalt",{"$f":"N33","v":0}]
["= Richtlijn tarief",null,null,"Uitvoerende aannemer:",null,"……………….."]
["= Af te spreken projectprijs",null,null,null,null,"…………………"]
[null,null,null,null,null,"…………………",null,"Totaal kosten:  ",null,null,null,null,{"$f":"+SUM(N11:N17)","v":0}]
["OMSCHRIJVING STRAATWERK / BERMEN;",null,null,null,null,null,null,null,null,null,null,null,null,{"$f":"IF(ROUND(SUM(N38:N51),2)-ROUND(M19,2)<>0,\"Fout in formulier\",\"\")","v":""}]
[{"$f":"+IF(AND(D25>0,D25<0.3),(\"invoer fout breedte tegels\"),IF(AND(D26>0,D26<0.3),(\"invoer fout breedte tegels\"),IF(AND(D27>0,D27<0.3),(\"invoer fout breedte tegels\"),\"\")))","v":""},null,"Sleuf",null,null,null,null,null,"Opsluiting",null,null,"Bomen en Struiken"]
[{"$f":"+IF(AND(G25>0,G25<0.25),(\"invoer fout breedte klinkers\"),IF(AND(G26>0,G26<0.25),(\"invoer fout breedte klinkers\"),IF(AND(G27>0,G27<0.25),(\"invoer fout breedte klinkers\"),\"\")))","v":""},null,"Tegels",null,null,"Klinkers",null,null,"trottoir-banden:","opsluit- / koprolband "]
[]
["adres",null,"lengte","breedte","m2","lengte","breedte","m2","m1","m1",null,"eenh.","prijs ","kosten"]
["………………………………….",null,null,null,{"$f":"IF($D$25>=0.3,($C$25*$D$25),\"\")","v":""},null,null,{"$f":"IF($G$25>=0.25,($F$25*$G$25),\"\")","v":""},null,null,null,null,null,{"$f":"IF($L25>0,$M25*($L25+0),\"\")","v":""}]
["………………………………….",null,null,null,{"$f":"IF($D$26>=0.3,($C$26*$D$26),\"\")","v":""},null,null,{"$f":"IF($G$26>=0.25,($F$26*$G$26),\"\")","v":""},null,null,null,null,null,{"$f":"IF($L26>0,$M26*($L26+0),\"\")","v":""}]
["………………………………….",null,null,null,{"$f":"IF($D$27>=0.3,($C$27*$D$27),\"\")","v":""},null,null,{"$f":"IF($G$27>=0.25,($F$27*$G$27),\"\")","v":""},null,null,null,null,null,{"$f":"IF($L27>0,$M27*($L27+0),\"\")","v":""}]
[null,null,{"$f":"MAX(C25:D25)+MAX(C26:D26)+MAX(C27:D27)","v":0},null,{"$f":"SUM(E25:E27)","v":0},{"$f":"MAX(F25:G25)+MAX(F26:G26)+MAX(F27:G27)","v":0},null,{"$f":"SUM(H25:H27)","v":0},{"$f":"SUM(I25:I27)","v":0},{"$f":"SUM(J25:K27)","v":0},null,{"$f":"SUM(L25:L27)","v":0},null,{"$f":"SUM(N25:N27)","v":0}]
[null,null,"Bermen, gazon herstel door gemeente",null,null,"Bermen, gazon herstel door aanbieder",null,null,"Asfalt, all in*",null,null,"Dikte","Prijs","Asfalt"]
["adres",null,"lengte","breedte","m2","lengte","breedte","m2","lengte (m)","breedte (m)",null,"cm","m2/cm","kosten"]
["…………………………………",null,null,null,{"$f":"IF(C31>0,C31*(D31+0),\"\")","v":""},null,null,{"$f":"IF(F31>0,F31*(G31+0),\"\")","v":""},null,null,null,null,null,{"$f":"IF($I31>0,($I$31*$J$31*$L$31)*($M$31),\"\")","v":""}]
["…………………………………",null,null,null,{"$f":"IF(C32>0,C32*(D32+0),\"\")","v":""},null,null,{"$f":"IF(F32>0,F32*(G32+0),\"\")","v":""},null,null,null,null,null,{"$f":"IF($I32>0,($I$32*$J$32*$L$32)*($M$32),\"\")","v":""}]
[null,null,null,null,{"$f":"SUM(E31:E32)","v":0},null,null,{"$f":"SUM(H30:H32)","v":0},{"$f":"SUM(I30:I32)","v":0},{"$f":"SUM(J30:K32)","v":0},null,null,null,{"$f":"SUM(N31:N32)","v":0}]
["Specificatie:",null,"* de gedefinieerde sleufbreedte dient te worden aangegeven, voor netbeheerders (niet zijnde aanbieders volgens Telecommunicatiewet) geldt de (gemiddelde) breedte van de opgebroken bestrating. In de tarieven is de gatvergroting meegerekend door een toeslag van 20%."]
["Tarief:",{"$f":"A9","v":1}]
["Categorie:",{"$f":"VLOOKUP(B7,'Gemeenten met categorie'!$A$3:$C$393,3,FALSE)","v":1},null,null,"Kosten per eenheid",null,"Degeneratiekosten",null,"Beheerk.","Subtotaal",null,null,null,"Totaal regel"]
["Omschrijving","Hoeveelheid","Eenheid","Sleuf m1","Uitv.kst","Onderh.k","Per rep.","Per m1","per eenheid","Uitv.k.","Onderh.k","Deg.kst.","Beheer.k"]
["klinkers <= 15 m2",{"$f":"IF($H$28<=15,$H$28,0)","v":0},"m2",null,{"$f":"IF($B$38>0,'Tabel Tarieven'!$R6,0)","v":0},{"$f":"IF($B38>0,'Tabel Tarieven'!$R22,0)","v":0},{"$f":"IF($B38>0,'Tabel Tarieven'!$R28,0)","v":0},null,{"$f":"IF($B38>0,'Tabel Tarieven'!$R34,0)","v":0},{"$f":"E38*B38","v":0},{"$f":"F38*B38","v":0},{"$f":"G38","v":0},{"$f":"I38*B38","v":0},{"$f":"+SUM(J38:M38)","v":0}]
["klinkers >15 m2",{"$f":"IF($H$28>15,IF($B$35=1,IF($H$28<=100,$H$28,0),$H$28),0)","v":0},"m2",{"$f":"IF(B39>0,$F$28,0)","v":0},{"$f":"IF(B39>0,'Tabel Tarieven'!$R7,0)","v":0},{"$f":"IF($B39>0,'Tabel Tarieven'!$R23,0)","v":0},null,{"$f":"IF($B39>0,'Tabel Tarieven'!$R29,0)","v":0},{"$f":"IF($B39>0,'Tabel Tarieven'!$R35,0)","v":0},{"$f":"E39*B39","v":0},{"$f":"F39*B39","v":0},{"$f":"H39*D39","v":0},{"$f":"I39*B39","v":0},{"$f":"+SUM(J39:M39)","v":0}]
["klinkers  >100 m2 (alleen A)",{"$f":"IF($B$35=1,IF($H$28>100,$H$28,0),0)","v":0},"m2",{"$f":"IF(B40>0,$F$28,0)","v":0},{"$f":"IF(B40>0,'Tabel Tarieven'!$R8,0)","v":0},{"$f":"IF($B40>0,'Tabel Tarieven'!$R24,0)","v":0},null,{"$f":"IF($B40>0,'Tabel Tarieven'!$R30,0)","v":0},{"$f":"IF($B40>0,'Tabel Tarieven'!$R36,0)","v":0},0,0,{"$f":"H40*D40","v":0},0,0]
{"$rows_left_out":49}
{"sheet":"Gemeenten met categorie","index":1,"n_rows":504,"n_cols":6,"rows_kept":504,"cut":false,"hidden":false,"merged":[]}
[null,"De Gemeenten van Nederland per 01-01-2020"]
[null,"Gemeente:","Indeling:"]
[1,"Aa en Hunze",1,"  Postbus 93,  9460 AB  GIETEN"]
[2,"Aalsmeer",2,"  Postbus 253, 1430 AG  AALSMEER"]
[3,"Aalten",1,"  Postbus 119,  7120 AC  AALTEN"]
[4,"Achterkarspelen",1,"  Postbus 2,  9285 ZV  BUITENPOST"]
[5,"Alblasserdam",5,"  Postbus 2,  2950 AA  ALBLASSERDAM"]
[6,"Albrandswaard",2,"  Postbus 1000,  3160 GA  RHOON"]
[7,"Alkmaar",1,"  Postbus 53,  1800 BC  ALKMAAR"]
[8,"Almelo",1,"  Postbus 5100,  7600 GC  ALMELO"]
[9,"Almere",3,"  Postbus  200,  1300 AE  ALMERE"]
[10,"Alphen aan de Rijn",5,"  Postbus 13,  2400 AA  ALPHEN AAN DE RIJN"]
[11,"Alphen-Chaam",1,"  Postbus 3,  5130 AA  ALPHEN"]
[12,"Altena",1,"  Sportlaan 170,  4286 ET ALMKERK"]
[13,"Ameland",1,"  Postbus 22,  9160 AA  HOLLUM"]
[14,"Amersfoort",1,"  Postbus 4000,  3800 EA  AMERSFOORT"]
[15,"Amstelveen",5,"  Postbus 4,  1180 BA  AMSTELVEEN"]
[16,"Amsterdam",3,"  Postbus 202,  1000 AE  AMSTERDAM"]
[17,"Apeldoorn",1,"  Postbus 9033,  7300 ES  APELDOORN"]
[18,"Appingedam",5,"  Postbus 15,  9900 AA  APPINGEDAM"]
[19,"Arnhem",1,"  Postbus 9029, 6800 EL  ARNHEM"]
[20,"Assen",1,"  Postbus 30018,  9400 RA  ASSEN"]
[21,"Asten",1,"  Postbus 290,  5720 AG  ASTEN"]
[22,"Baarle-Nassau",1,"  Postbus 105,  5110 AC  BAARLE-NASSAU"]
[23,"Baarn",1,"  Postbus 1003,  3740 BA  BAARN"]
[24,"Barendrecht",5,"  Postbus 501,  2990 EA  BARENDRECHT"]
[25,"Barneveld",1,"  Postbus 63,  3770 AB  BARNEVELD"]
[26,"Beek",1,"  Postbus 20,  6190 AA  BEEK"]
[27,"Beekdaelen",1,"  Postbus 22000,  6360 AA NUTH"]
[28,"Beemster",4,"  Postbus 7,  1462 ZG  MIDDENBEEMSTER"]
[29,"Beesel",1,"  Postbus 4750,  5953 ZK  REUVER"]
[30,"Berg en Dal ",1,"  Postbus 20, 6560 AA GROESBEEK"]
[31,"Bergeijk",1,"  Postbus 10000,  5570 GA  BERGEIJK"]
[32,"Bergen (L.)",1,"  Postbus 140,  5854 ZJ  BERGEN (L.)"]
[33,"Bergen (NH.)",1,"  Postbus 175,  1860 AD  BERGEN (NH.)"]
[34,"Bergen op Zoom",1,"  Postbus 35,  4600 AA  BERGEN OP ZOOM"]
[35,"Berkelland",1,"  Postbus 200, 7270 HA BORCULO"]
[36,"Bernheze",1,"  Postbus 19,  5384 ZG  HEESH"]
[37,"Best",1,"  Postbus 50,  5680 AB  BEST"]
[38,"Beuningen",1,"  Postbus 14,  6640 AA  BEUNINGEN"]
{"$rows_left_out":465}
{"sheet":"INFO","index":2,"n_rows":75,"n_cols":5,"rows_kept":75,"cut":false,"hidden":false,"merged":[]}
[]
[null,null,"Werking \"Rekenblad\":"]
[null,"-","Door de groene posities in te vullen vindt de verrekening plaats volgens de \"Richtlijn tarieven (graaf) werkzaamheden Telecom\"."]
[null,"-","Om de bomen, struiken en het asfalt te kunnen verrekenen kan een projectprijs worden afgesproken en ingevoerd."]
[null,"-","Door scrollen kan de gemeente worden ingesteld en daarna opgeslagen. Dus een éénmalige actie!"]
[null,"-","Tevens kan door scrollen de aard van de werkzaamheden worden ingesteld."]
[null,"-","Door beide scrollbeweging uit te voeren worden de gemeente en de juiste tarieven ingesteld."]
[]
[null,null,"Dit \"Rekenblad\" is een uitgave van de Vereniging van Nederlandse Gemeenten en is gebaseerd op:"]
[null,null,"\"RICHTLIJN tarieven (graaf)werkzaamheden Telecom\", uitgegeven: 12 maart 2004"]
[null,null,"Richtlijn voor gemeenten en aanbieders van telecom diensten ten behoeve van het berekenen van tarieven voor herstel, onderhoud, beheer- en "]
[null,null,"degeneratiekosten bij (graaf)werkzaamheden door aanbieders, in openbare gronden die in eigendom of beheer zijn van gemeenten."]
[null,"-","De Richtlijn bevat: ",null,"definities, rekenmethodiek en tarieven"]
[null,"-","In de tarieven wordt geen onderscheid gemaakt tussen lasgaten en sleuven. Alle werkzaamheden worden berekend per vierkante meter."]
[null,null,"De degeneratie vergoeding wordt verrekend per strekkende meter."]
[null,"-","Bij de berekening van de degeneratie vergoeding wordt gebruik gemaakt van de per 1 januari 2001 gehanteerde berekenwijze voor de"]
[null,null,"maatstaf bodemgesteldheid ten behoeve van de algemene uitkering uit het gemeentefonds. De bodempercentages t.g.v. samenvoegingen van gemeenten"]
[null,null,"zijn berekend tot 1 januari van het voorafgaande jaar."]
[]
[null,null,"Gebruik van dit rekenblad"]
[null,"-","De wijze van de sleufbreedte is als volgt gedefinieerd:"]
[null,null,null,"- de werkelijke sleufbreedte, deze wordt tijdens de uitvoering gemeten"]
[null,null,null,"* de werkelijke sleufbreedte wordt ingevoerd in het rekenblad"]
[null,null,null,"* het rekenblad rekent met de oppervlakte (lengte x breedte) zoals ingevuld. "]
[null,null,null,"* de gatvergroting wordt niet in oppervlak uitgedrukt maar in een toeslag van 20% op de uitvoeringskosten (en dus op alle tariefcomponenten)"]
[null,null,null,"Geen sleufbreedte gemeten  "]
[null,null,null,"- de gemiddelde breedte van het grondverzet, gemeten als breedte van de toegepaste graafbak, naar boven afgerond op 5 cm, "]
[null,null,null,"- met een minimum breedte voor tegelverharding van 30 cm en voor klinkerverharding van 20 cm."]
[null,"-","De \"Richtlijn\" is van toepassing op het herstel van opgebroken bestrating."]
[null,"-","In de \"Richtlijn\" is aangegeven wanneer de sleuf door de aanbieder moet worden gedicht en onder welke voorwaarden dit is toegestaan."]
[null,"-","De werkzaamheden die de gemeente verricht en waarvoor bij het verlenen van het instemmingbesluit leges worden geheven, vallen niet"]
[null,null,"onder de berekening van de beheerskosten in deze \"Richtlijn\"."]
[null,"-","In de rekenmethodiek van de \"Richtlijn\" zijn ook groenvoorzieningen opgenomen."]
[null,"-","De \"Richtlijn\" bevat ook een degeneratievergoeding voor tegelverharding."]
[null,"-","Per project is het aantal m2 bepalend voor de toepassing van tarief <15 m2 of >15 m2, afzonderlijk voor tegels en klinkers. Dus tegel- en "]
[null,null,"klinkeroppervlakken niet bij elkaar optellen. Op het rekenblad gaat dat automatisch."]
[null,"-","Meerdere kleine opbrekingen binnen 10 m (zoals huisaansluitingen) worden aangemerkt als één reparatie."]
[null,"-","Op de tarieven is indexering van toepassing. Jaarlijks zal door de VNG een geïndexeerd \"Rekenblad\" tijdig ter beschikking worden gesteld."]
[]
[null,null,"Afwijkende tarieven"]
{"$rows_left_out":36}
{"sheet":"Tabel Tarieven","index":3,"n_rows":665,"n_cols":20,"rows_kept":665,"cut":false,"hidden":false,"merged":[[3,17,4,19],[0,17,0,19],[2,15,3,15],[46,0,48,15],[0,1,0,7],[0,10,0,15],[1,8,4,9],[2,10,3,10],[2,11,3,11],[2,12,3,12],[2,13,3,13],[2,14,3,14],[1,1,2,7]]}
["Kostensoort","Tariefgroepen",null,null,null,null,null,null,"Omschrijving","Eenheid","Bedragen  2021 v1 per kostensoort per bodemcategorie",null,null,null,null,null,null,"Actueel tarief"]
["Uitvoeringskosten","X in kolom is van toepassing bij deze tariefgroep",null,null,null,null,null,null,"Klinkers, tegels, trottoirband, opsluit/koprolband, berm/gazon.\nEenheid: per m2, m1,\nbij degenaratie per reparatie of m1 sleuf",null,"Afh. Cat.?:","Bij  nee zijn de tarieven gelijk in elke kolom: onafhankelijk categorie",null,null,null,null,null,"Tarief",{"$f":"Rekenblad!B35","v":1}]
["Onderhoudskosten",null,null,null,null,null,null,null,null,null,"> Zie\n> tabblad >>>>","< 50% slechte bodem","50-60% slechte bodem","60-70% slechte bodem","70-80% slechte bodem","> 80% slechte bodem",null,"Categorie",{"$f":"Rekenblad!B36","v":1}]
["Degeneratiekosten",1,2,3,4,5,6,"-",null,null,null,null,null,null,null,null,null,"Toelichting: deze waarden worden gebruikt in het Rekenblad en zijn afhankelijk van de invoer op het Rekenblad"]
["Beheerkosten","A","B1","B2","C","C1","C2","D",null,null,"Afh. Cat.?",1,2,3,4,5]
["Uitvoeringskosten","X ",null,null,null,null,null,null,"klinkers <= 15 m2","m2","Nee",31.08,31.08,31.08,31.08,31.08,null,{"$f":"IF($S$2=1,INDEX($L$6:$P$45,,$S$3),0)+R14","v":31.08},"Uitvoeringskosten C opgeteld regel 14"]
["Uitvoeringskosten","X ",null,null,null,null,null,null,"klinkers >15 m2","m2","Nee",25.43,25.43,25.43,25.43,25.43,null,{"$f":"IF($S$2=1,INDEX($L$6:$P$45,,$S$3),0)+R15","v":25.43},"Uitvoeringskosten C opgeteld regel 15"]
["Uitvoeringskosten","X ",null,null,null,null,null,null,"klinkers  >100 m2","m2","Nee",22.6,22.6,22.6,22.6,22.6,null,{"$f":"IF($S$2=1,INDEX($L$6:$P$45,,$S$3),0)","v":22.6}]
["Uitvoeringskosten","X ",null,null,null,null,null,null,"tegels   <= 15 m2","m2","Nee",24.67,24.67,24.67,24.67,24.67,null,{"$f":"IF($S$2=1,INDEX($L$6:$P$45,,$S$3),0)+R16","v":24.67},"Uitvoeringskosten C opgeteld regel 16"]
["Uitvoeringskosten","X ",null,null,null,null,null,null,"tegels   >15 m2","m2","Nee",19.02,19.02,19.02,19.02,19.02,null,{"$f":"IF($S$2=1,INDEX($L$6:$P$45,,$S$3),0)+R17","v":19.02},"Uitvoeringskosten C opgeteld regel 17"]
["Uitvoeringskosten","X ",null,null,null,null,null,null,"tegels   >100 m2","m2","Nee",17.88,17.88,17.88,17.88,17.88,null,{"$f":"IF($S$2=1,INDEX($L$6:$P$45,,$S$3),0)","v":17.88}]
["Uitvoeringskosten","X ",null,null,null,null,null,null,"trottoirband","m1","Nee",11.61,11.61,11.61,11.61,11.61,null,{"$f":"IF($S$2=1,INDEX($L$6:$P$45,,$S$3),0)+R18","v":11.61},"Uitvoeringskosten C opgeteld regel 18"]
["Uitvoeringskosten","X ",null,null,null,null,null,null,"opsluit/koprolband","m1","Nee",9.25,9.25,9.25,9.25,9.25,null,{"$f":"IF($S$2=1,INDEX($L$6:$P$45,,$S$3),0)+R19","v":9.25},"Uitvoeringskosten C opgeteld regel 19"]
["Uitvoeringskosten",null,null,null,"X ",null,null,null,"klinkers <= 15 m2","m2","Nee",12.95,12.95,12.95,12.95,12.95,null,{"$f":"IF($S$2=4,INDEX($L$6:$P$45,,$S$3),0)","v":0},"Is opgeteld bij regel 6"]
["Uitvoeringskosten",null,null,null,"X ",null,null,null,"klinkers >15 m2","m2","Nee",10.6,10.6,10.6,10.6,10.6,null,{"$f":"IF($S$2=4,INDEX($L$6:$P$45,,$S$3),0)","v":0},"Is opgeteld bij regel 7"]
["Uitvoeringskosten",null,null,null,"X ",null,null,null,"tegels   <= 15 m2","m2","Nee",10.28,10.28,10.28,10.28,10.28,null,0,"Is opgeteld bij regel 9"]
["Uitvoeringskosten",null,null,null,"X ",null,null,null,"tegels   >15 m2","m2","Nee",7.93,7.93,7.93,7.93,7.93,null,0,"Is opgeteld bij regel 10"]
["Uitvoeringskosten",null,null,null,"X ",null,null,null,"trottoirband","m1","Nee",4.84,4.84,4.84,4.84,4.84,null,0,"Is opgeteld bij regel 12"]
["Uitvoeringskosten",null,null,null,"X ",null,null,null,"opsluit/koprolband","m1","Nee",3.85,3.85,3.85,3.85,3.85,null,0,"Is opgeteld bij regel 13"]
["Uitvoeringskosten",null,null,null,null,null,null,"X","berm / gazon <= 15 m2, herstel gemeente","opbr.","Nee",32.400000000000006,32.400000000000006,32.400000000000006,32.400000000000006,32.400000000000006,null,{"$f":"INDEX($L$6:$P$45,,$S$3)","v":32.400000000000006}]
["Uitvoeringskosten",null,null,null,null,null,null,"X","berm / gazon >15 m2, herstel gemeente","m2","Nee",2.16,2.16,2.16,2.16,2.16,null,2.16]
["Onderhoudskosten","X",null,"X",null,null,"X",null,"klinkers <= 15 m2","m2","Ja",2.2999999999999998,2.6,3.48,5.3,5.91,null,{"$f":"IF(OR($S$2=1,$S$2=3,$S$2=4,$S$2=6),INDEX($L$6:$P$45,,$S$3),0)","v":2.2999999999999998}]
["Onderhoudskosten","X",null,"X",null,null,"X",null,"klinkers >15 m2","m2","Ja",1.88,2.12,2.85,4.34,4.83,null,{"$f":"IF(OR($S$2=1,$S$2=3,$S$2=4,$S$2=6),INDEX($L$6:$P$45,,$S$3),0)","v":1.88}]
["Onderhoudskosten","X",null,null,null,null,null,null,"klinkers  >100 m2 ","m2","Ja",1.67,1.89,2.5299999999999998,3.85,4.29,null,{"$f":"IF($S$2=1,INDEX($L$6:$P$45,,$S$3),0)","v":1.67}]
["Onderhoudskosten","X",null,"X",null,null,"X",null,"tegels   <= 15 m2","m2","Ja",1.27,1.46,2.02,3.33,3.76,null,{"$f":"IF(OR($S$2=1,$S$2=3,$S$2=4,$S$2=6),INDEX($L$6:$P$45,,$S$3),0)","v":1.27}]
["Onderhoudskosten","X",null,"X",null,null,"X",null,"tegels   >15 m2","m2","Ja",0.98,1.1200000000000001,1.56,2.57,2.9,null,{"$f":"IF(OR($S$2=1,$S$2=3,$S$2=4,$S$2=6),INDEX($L$6:$P$45,,$S$3),0)","v":0.98}]
["Onderhoudskosten","X",null,null,null,null,null,null,"tegels   >100 m2","m2","Ja",0.92,1.06,1.47,2.41,2.73,null,{"$f":"IF($S$2=1,INDEX($L$6:$P$45,,$S$3),0)","v":0.92}]
["Degeneratiekosten","X","X","X",null,null,null,null,"klinkers <= 15 m2","reparatie","Ja",8.39,11.8,22.03,33.83,41.44,null,{"$f":"IF($S$2<4,INDEX($L$6:$P$45,,$S$3),0)","v":8.39}]
["Degeneratiekosten","X","X","X",null,null,null,null,"klinkers >15 m2","m1 sleuf","Ja",2.79,3.92,7.3,14.54,16.95,null,{"$f":"IF($S$2<4,INDEX($L$6:$P$45,,$S$3),0)","v":2.79}]
["Degeneratiekosten","X",null,null,null,null,null,null,"klinkers  >100 m2","m1 sleuf","Ja",2.48,3.48,6.48,12.92,15.07,null,{"$f":"IF($S$2=1,INDEX($L$6:$P$45,,$S$3),0)","v":2.48}]
["Degeneratiekosten","X","X","X",null,null,null,null,"tegels   <= 15 m2","reparatie","Ja",0,0.83,3.33,9.58,11.66,null,{"$f":"IF($S$2<4,INDEX($L$6:$P$45,,$S$3),0)","v":0}]
["Degeneratiekosten","X","X","X",null,null,null,null,"tegels   >15 m2","m1 sleuf","Ja",0,0.16,0.64,7.86,10.27,null,{"$f":"IF($S$2<4,INDEX($L$6:$P$45,,$S$3),0)","v":0}]
["Degeneratiekosten","X",null,null,null,null,null,null,"tegels   >100 m2","m1 sleuf","Ja",0,0.15,0.6,7.39,9.66,null,{"$f":"IF($S$2=1,INDEX($L$6:$P$45,,$S$3),0)","v":0}]
["Beheerskosten","X","X","X","X","X","X",null,"klinkers <= 15 m2","m2","Nee",1.86,1.86,1.86,1.86,1.86,null,{"$f":"INDEX($L$6:$P$45,,$S$3)","v":1.86}]
["Beheerskosten","X","X","X","X","X","X",null,"klinkers >15 m2","m2","Nee",1.53,1.53,1.53,1.53,1.53,null,1.53]
["Beheerskosten","X",null,null,null,null,null,null,"klinkers  >100 m2 ","m2","Nee",1.36,1.36,1.36,1.36,1.36,null,1.36]
["Beheerskosten","X","X","X","X","X","X",null,"tegels   <= 15 m2","m2","Nee",1.48,1.48,1.48,1.48,1.48,null,1.48]
["Beheerskosten","X","X","X","X","X","X",null,"tegels   >15 m2","m2","Nee",1.1399999999999999,1.1399999999999999,1.1399999999999999,1.1399999999999999,1.1399999999999999,null,1.1399999999999999]
["Beheerskosten","X",null,null,null,null,null,null,"tegels   >100 m2","m2","Nee",1.07,1.07,1.07,1.07,1.07,null,1.07]
["Beheerskosten","X","X","X","X","X","X",null,"trottoirband","m1","Nee",0.7,0.7,0.7,0.7,0.7,null,0.7]
{"$rows_left_out":625}